{"text_format":"1","workbook":"xlsx","n_sheets":4,"sheets":["Kaiserex Balance","CMC Summary","CMC Data","XE Data"],"not_rendered":{"charts":0,"images":6,"macros":1,"external_links":0,"defined_names":2,"comments":0,"pivot_tables":0},"unopened":[],"bounds":{"document_bytes":16777216,"sheet_cells":100000,"rows_first":2000,"rows_last":500,"rows_between":2000,"halvings":0,"cell_chars":16384,"cell_head_chars":4096},"cells_cut":0,"cells_raw":0,"read":"whole","date_system":"1900"}

{"sheet":"Kaiserex Balance","index":0,"n_rows":6,"n_cols":7,"rows_kept":6,"cut":false,"hidden":false,"merged":[[0,0,0,6],[3,3,3,4],[4,3,4,4],[5,3,5,4],[3,0,5,2]]}
["Kaiserex balance estimation"]
["EUR","CRYPTO5","Bitcoin","Ethereum","Maidsafe","Monero","Factom"]
[0,1,1,25,1000,50,50]
[null,null,null,"CRYPTO5 value:",null,{"$f":"B3*'CMC Summary'!C2+25*'CMC Summary'!C3*B3+1000*'CMC Summary'!C4*B3+50*'CMC Summary'!C5*B3+50*'CMC Summary'!C6*B3","v":2727.4399999999996},{"$f":"F4*'CMC Summary'!B8","v":2579.5854775999996}]
[null,null,null,"Other CRYPTO value:",null,{"$f":"C3*'CMC Summary'!C2+'Kaiserex Balance'!D3*'CMC Summary'!C3+'Kaiserex Balance'!E3*'CMC Summary'!C4+'Kaiserex Balance'!F3*'CMC Summary'!C5+'Kaiserex Balance'!G3*'CMC Summary'!C6","v":2727.4399999999996},{"$f":"F5*'CMC Summary'!B8","v":2579.5854775999996}]
[null,null,null,"Total account value:",null,{"$f":"A3+F4+F5","v":5454.8799999999992},{"$f":"F6*'CMC Summary'!B8","v":5159.1709551999993}]

{"sheet":"CMC Summary","index":1,"n_rows":8,"n_cols":6,"rows_kept":8,"cut":false,"hidden":true,"merged":[]}
["Name","Market Cap","Price","Available Supply","Daily Volume","Daily Change"]
["Bitcoin",{"$f":"VLOOKUP(\"*\" & A2 & \"*\",'CMC Data'!B:C,2,FALSE)","v":"$19,845,059,234"},{"$f":"VALUE(SUBSTITUTE(SUBSTITUTE(VLOOKUP(\"*\" & A2 & \"*\",'CMC Data'!B:D,3,FALSE), \".\",\",\"),\"$\",\"\"))","v":1224.8599999999999},{"$f":"ONLYNUMS(VLOOKUP(\"*\" & A2 & \"*\",'CMC Data'!B:E,4,FALSE))","v":16201900},{"$f":"VLOOKUP(\"*\" & A2 & \"*\",'CMC Data'!B:G,5,FALSE)","v":"$240,355,000"},{"$f":"VLOOKUP(\"*\" & A2 & \"*\",'CMC Data'!B:H,6,FALSE)","v":"-3.89%"}]
["Ethereum",{"$f":"VLOOKUP(\"*\" & A3 & \"*\",'CMC Data'!B:C,2,FALSE)","v":"$1,705,341,738"},{"$f":"VALUE(SUBSTITUTE(SUBSTITUTE(VLOOKUP(\"*\" & A3 & \"*\",'CMC Data'!B:D,3,FALSE), \".\",\",\"),\"$\",\"\"))","v":19.05},{"$f":"ONLYNUMS(VLOOKUP(\"*\" & A3 & \"*\",'CMC Data'!B:E,4,FALSE))","v":89526301},{"$f":"VLOOKUP(\"*\" & A3 & \"*\",'CMC Data'!B:G,5,FALSE)","v":"$40,516,200"},{"$f":"VLOOKUP(\"*\" & A3 & \"*\",'CMC Data'!B:H,6,FALSE)","v":"-2.62%"}]
["MaidSafeCoin",{"$f":"VLOOKUP(\"*\" & A4 & \"*\",'CMC Data'!B:C,2,FALSE)","v":"$73,462,833"},{"$f":"VALUE(SUBSTITUTE(SUBSTITUTE(VLOOKUP(\"*\" & A4 & \"*\",'CMC Data'!B:D,3,FALSE), \".\",\",\"),\"$\",\"\"))","v":0.16233},{"$f":"ONLYNUMS(VLOOKUP(\"*\" & A4 & \"*\",'CMC Data'!B:E,4,FALSE))","v":452552412},{"$f":"VLOOKUP(\"*\" & A4 & \"*\",'CMC Data'!B:G,5,FALSE)","v":338.548},{"$f":"VLOOKUP(\"*\" & A4 & \"*\",'CMC Data'!B:H,6,FALSE)","v":"-1.89%"}]
["Monero",{"$f":"VLOOKUP(\"*\" & A5 & \"*\",'CMC Data'!B:C,2,FALSE)","v":"$198,101,743"},{"$f":"VALUE(SUBSTITUTE(SUBSTITUTE(VLOOKUP(\"*\" & A5 & \"*\",'CMC Data'!B:D,3,FALSE), \".\",\",\"),\"$\",\"\"))","v":14.08},{"$f":"ONLYNUMS(VLOOKUP(\"*\" & A5 & \"*\",'CMC Data'!B:E,4,FALSE))","v":14070426},{"$f":"VLOOKUP(\"*\" & A5 & \"*\",'CMC Data'!B:G,5,FALSE)","v":"$6,023,110"},{"$f":"VLOOKUP(\"*\" & A5 & \"*\",'CMC Data'!B:H,6,FALSE)","v":"-10.04%"}]
["Factom",{"$f":"VLOOKUP(\"*\" & A6 & \"*\",'CMC Data'!B:C,2,FALSE)","v":"$27,990,256"},{"$f":"VALUE(SUBSTITUTE(SUBSTITUTE(VLOOKUP(\"*\" & A6 & \"*\",'CMC Data'!B:D,3,FALSE), \".\",\",\"),\"$\",\"\"))","v":3.2},{"$f":"ONLYNUMS(VLOOKUP(\"*\" & A6 & \"*\",'CMC Data'!B:E,4,FALSE))","v":8753219},{"$f":"VLOOKUP(\"*\" & A6 & \"*\",'CMC Data'!B:G,5,FALSE)","v":549.178},{"$f":"VLOOKUP(\"*\" & A6 & \"*\",'CMC Data'!B:H,6,FALSE)","v":"0.52%"}]
[]
["USD/EUR",{"$f":"VALUE(SUBSTITUTE('XE Data'!D76,\".\",\",\"))","v":0.94579000000000002}]

{"sheet":"CMC Data","index":2,"n_rows":163,"n_cols":8,"rows_kept":163,"cut":false,"hidden":true,"merged":[]}
["Follow @CoinMKTCap"]
["CryptoCurrency Market Capitalizations"]
[]
["Toggle navigation "]
["Market Cap "]
["All"]
["Currencies"]
["Assets"]
["Trade Volume "]
["24 Hour Volume Rankings (Currency)"]
["24 Hour Volume Rankings (Exchange)"]
["Monthly Volume Rankings (Currency)"]
["Trending "]
["Gainers and Losers"]
["Recently Added"]
["Tools "]
["Global Charts"]
["Historical Snapshots"]
["Currency Converter Calculator"]
["All "]
["Top 100"]
["Full List"]
["Currencies "]
["Top 100"]
["Full List"]
["Market Cap by Circulating Supply"]
["Market Cap by Total Supply"]
["Filter Non-Mineable"]
["Filter Premined"]
["Filter Non-Mineable and Premined"]
["Assets "]
["Top 100"]
["Full List"]
["Market Cap by Circulating Supply"]
["Market Cap by Total Supply"]
["USD "]
["USD"]
["BTC"]
["EUR"]
["CNY"]
["GBP"]
["CAD"]
["RUB"]
["HKD"]
["JPY"]
["AUD"]
["Next 100 →"]
["View All"]
["#","Name","Market Cap","Price","Circulating Supply","Volume (24h)","% Change (24h)","Price Graph (7d)"]
[1,"BitcoinBitcoin","$19,845,059,234","$1224.86","16,201,900 BTC ","$240,355,000","-3.89%","sparkline"]
[2,"EthereumEthereum","$1,705,341,738","$19.05","89,526,301 ETH ","$40,516,200","-2.62%","sparkline"]
[3,"DashDash","$321,628,797","$44.98","7,150,135 DASH ","$10,520,400","0.68%","sparkline"]
[4,"RippleRipple","$224,938,112","$0.006013","37,406,829,143 XRP *","$1,058,300","-1.51%","sparkline"]
[5,"MoneroMonero","$198,101,743","$14.08","14,070,426 XMR ","$6,023,110","-10.04%","sparkline"]
[6,"LitecoinLitecoin","$190,890,321","$3.81","50,080,232 LTC ","$6,143,620","-1.60%","sparkline"]
[7,"Ethereum ClassicEthereum Classic","$122,582,363","$1.37","89,490,548 ETC ","$2,240,400","-3.15%","sparkline"]
[8,"NEMNEM","$99,489,600","$0.011054","8,999,999,999 XEM *",778.54200000000003,"2.37%","sparkline"]
[9,"MaidSafeCoinMaidSafeCoin","$73,462,833","$0.162330","452,552,412 MAID *",338.548,"-1.89%","sparkline"]
[10,"AugurAugur","$63,420,830","$5.77","11,000,000 REP *",279.62599999999998,"-2.20%","sparkline"]
[11,"ZcashZcash","$31,072,551","$38.28","811,781 ZEC ","$1,273,020","-0.60%","sparkline"]
[12,"FactomFactom","$27,990,256","$3.20","8,753,219 FCT *",549.178,"0.52%","sparkline"]
[13,"IconomiIconomi","$27,803,895","$0.319585","87,000,000 ICN *",60.904000000000003,"-5.07%","sparkline"]
[14,"TetherTether","$24,950,877","$1.00","24,950,378 USDT *","$8,069,610","0.00%","sparkline"]
[15,"DogecoinDogecoin","$22,688,387","$0.000209","108,426,141,411 DOGE ",155.739,"-0.35%","sparkline"]
[16,"SteemSteem","$22,645,603","$0.094820","238,826,281 STEEM ",52.003999999999998,"-4.26%","sparkline"]
[17,"WavesWaves","$21,889,300","$0.218893","100,000,000 WAVES *",287.17399999999998,"-10.13%","sparkline"]
[18,"DigixDAODigixDAO","$19,939,980","$9.97","2,000,000 DGD *",54.1,"-4.88%","sparkline"]
[19,"GolemGolem","$18,151,028","$0.022135","820,000,000 GNT *",228.08199999999999,"-5.60%","sparkline"]
[20,"ArdorArdor","$16,101,874","$0.016118","998,999,495 ARDR *",95.992000000000004,"0.62%","sparkline"]
[21,"GameCreditsGameCredits","$15,346,772","$0.251036","61,133,750 GAME ",444.185,"5.16%","sparkline"]
[22,"Stellar LumensStellar Lumens","$13,342,940","$0.001910","6,987,295,521 XLM *",411.63799999999998,"7.77%","sparkline"]
[23,"LiskLisk","$12,095,032","$0.116254","104,039,710 LSK *",105.738,"-7.61%","sparkline"]
[24,"ShadowCashShadowCash","$10,828,908","$1.63","6,636,987 SDC *",34.582999999999998,"2.58%","sparkline"]
[25,"BytecoinBytecoin","$10,734,672","$0.000059","182,560,586,739 BCN ",2.2770000000000001,"7.34%","sparkline"]
[26,"DecredDecred","$10,237,283","$2.58","3,966,094 DCR ",205.43199999999999,"22.85%","sparkline"]
[27,"PeercoinPeercoin","$10,119,082","$0.422872","23,929,421 PPC ",502.47800000000001,"-11.26%","sparkline"]
[28,"BitSharesBitShares","$9,512,549","$0.003677","2,586,900,000 BTS *",160.64599999999999,"3.79%","sparkline"]
[29,"KomodoKomodo","$9,193,941","$0.091316","100,682,362 KMD ",36.014000000000003,"-3.62%","sparkline"]
[30,"StratisStratis","$8,577,548","$0.087262","98,296,483 STRAT ",98.272000000000006,"-9.28%","sparkline"]
[31,"SiacoinSiacoin","$8,508,976","$0.000356","23,894,168,760 SC ",66.600999999999999,"1.37%","sparkline"]
[32,"SingularDTVSingularDTV","$8,172,000","$0.013620","600,000,000 SNGLS *",8.5289999999999999,"-9.27%","sparkline"]
[33,"Storjcoin XStorjcoin X","$8,154,592","$0.161579","50,468,144 SJCX *",35.911000000000001,"2.72%","sparkline"]
[34,"XaurumXaurum","$8,094,184","$0.090111","89,824,095 XAUR *",42.445999999999998,"-5.05%","sparkline"]
[35,"EmercoinEmercoin","$7,922,344","$0.199764","39,658,517 EMC ",120.592,"3.60%","sparkline"]
[36,"NxtNxt","$7,884,048","$0.007892","998,999,983 NXT *",99.212000000000003,"-0.29%","sparkline"]
[37,"BitcrystalsBitcrystals","$7,535,122","$0.182067","41,386,534 BCY *",7.64,"-5.19%","sparkline"]
[38,"CounterpartyCounterparty","$7,508,187","$2.87","2,619,817 XCP *",10.81,"-4.82%","sparkline"]
[39,"First BloodFirst Blood","$7,400,474","$0.086496","85,558,371 1ST *",121.441,"3.60%","sparkline"]
[40,"ByteballByteball","$7,202,789","$61.24","117,610 GBYTE *",9.3480000000000008,"-19.56%","sparkline"]
[41,"I/O CoinI/O Coin","$7,030,695","$0.430885","16,316,870 IOC *",11.9,"-6.53%","sparkline"]
[42,"GuldenGulden","$6,899,884","$0.020204","341,517,545 NLG **",10.872999999999999,"-6.80%","sparkline"]
[43,"BitcoinDarkBitcoinDark","$6,168,726","$4.79","1,288,862 BTCD ",5.0739999999999998,"8.87%","sparkline"]
[44,"AntSharesAntShares","$5,909,500","$0.118190","50,000,000 ANS *",9.016,"-3.50%","sparkline"]
[45,"RubycoinRubycoin","$5,887,425","$0.244446","24,084,766 RBY *",7.02,"-0.84%","sparkline"]
[46,"SysCoinSysCoin","$5,523,512","$0.010556","523,233,254 SYS ",25.096,"-6.88%","sparkline"]
[47,"BitConnectBitConnect","$4,982,513","$0.917637","5,429,721 BCC ",84.656999999999996,"2.39%","sparkline"]
[48,"NamecoinNamecoin","$4,867,654","$0.330315","14,736,400 NMC ",407.22500000000002,"-8.29%","sparkline"]
[49,"ChronobankChronobank","$4,671,200","$6.58","710,113 TIME *",91.521000000000001,"-2.96%","sparkline"]
[50,"NexusNexus","$4,668,973","$0.098340","47,477,671 NXS ",17.823,"-3.36%","sparkline"]
[51,"Agoras TokensAgoras Tokens","$4,323,354","$0.102937","42,000,000 AGRS *",2.117,"1.03%","sparkline"]
[52,"PotCoinPotCoin","$3,963,525","$0.018347","216,035,926 POT ",125.407,"0.35%","sparkline"]
[53,"YbCoinYbCoin","$3,892,579","$1.29","3,017,901 YBC *",30.483000000000001,"-1.64%","sparkline"]
[54,"E-Dinar CoinE-Dinar Coin","$3,799,659","$0.278943","13,621,634 EDR ",780.39300000000003,"-6.35%","sparkline"]
[55,"CreditbitCreditbit","$3,756,566","$0.299230","12,554,110 CRBIT ",503.52,"21.44%","sparkline"]
[56,"SolarCoinSolarCoin","$3,460,063","$0.099031","34,939,293 SLR *",9.9659999999999993,"-7.02%","sparkline"]
[57,"NexiumNexium","$3,313,779","$0.049815","66,521,586 NXC *",14.513999999999999,"-3.50%","sparkline"]
[58,"SynereoSynereo","$3,030,224","$0.036839","82,256,324 AMP *",5.2320000000000002,"-2.98%","sparkline"]
[59,"GolosGolos","$2,925,081","$0.024627","118,777,300 GOLOS ",1.462,"-4.82%","sparkline"]
[60,"ZCoinZCoin","$2,900,152","$2.39","1,211,334 XZC ",181.29599999999999,"-2.50%","sparkline"]
[61,"BlackCoinBlackCoin","$2,635,462","$0.034677","76,000,519 BLK *",23.882999999999999,"-0.44%","sparkline"]
[62,"IONION","$2,614,698","$0.229135","11,411,168 ION *",6.2270000000000003,"1.26%","sparkline"]
[63,"SIBCoinSIBCoin","$2,482,752","$0.180884","13,725,661 SIB ",30.018000000000001,"20.52%","sparkline"]
[64,"LoMoCoinLoMoCoin","$2,460,055","$0.012134","202,735,664 LMC *",3.9910000000000001,"-3.91%","sparkline"]
[65,"VerosVeros","$2,397,307","$0.049216","48,709,618 VRS *",25.713000000000001,"-2.00%","sparkline"]
[66,"NAV CoinNAV Coin","$2,282,181","$0.037574","60,738,135 NAV *",18.244,"2.74%","sparkline"]
[67,"SuperNETSuperNET","$2,186,358","$2.68","816,061 UNITY *",1.321,"-4.34%","sparkline"]
[68,"PIVXPIVX","$2,164,749","$0.041503","52,158,236 PIVX ",13.79,"-4.62%","sparkline"]
[69,"MonaCoinMonaCoin","$2,125,863","$0.045628","46,591,100 MONA ",1.3380000000000001,"6.10%","sparkline"]
[70,"GridCoinGridCoin","$2,125,300","$0.005483","387,647,360 GRC ",1.06,"1.62%","sparkline"]
[71,"BoolberryBoolberry","$2,111,605","$0.230004","9,180,732 XBB ",16.315000000000001,"-4.87%","sparkline"]
[72,"DigiByteDigiByte","$2,038,294","$0.000251","8,107,031,908 DGB ",19.658999999999999,"14.82%","sparkline"]
[73,"OmniOmni","$1,919,458","$3.44","558,233 OMNI *",11.084,"-3.29%","sparkline"]
[74,"AeonAeon","$1,861,171","$0.135886","13,696,562 AEON ",874,"-11.06%","sparkline"]
[75,"VPNCoinVPNCoin","$1,740,569","$0.004348","400,339,746 VPN *",275.94499999999999,"18.51%","sparkline"]
[76,"ClamsClams","$1,704,926","$0.789649","2,159,093 CLAM *",28.745999999999999,"-10.18%","sparkline"]
[77,"BurstBurst","$1,653,412","$0.000961","1,720,816,043 BURST ",33.619,"1.21%","sparkline"]
[78,"Pepe CashPepe Cash","$1,584,370","$0.002257","701,884,009 PEPECASH *",2.09,"6.84%","sparkline"]
[79,"FairCoinFairCoin","$1,576,763","$0.029768","52,968,016 FAIR *",440,"-3.90%","sparkline"]
[80,"NovacoinNovacoin","$1,564,324","$0.943018","1,658,849 NVC ",88.447999999999993,"-3.09%","sparkline"]
[81,"vSlicevSlice","$1,560,448","$0.046733","33,390,496 VSL *",1.141,"-6.50%","sparkline"]
[82,"RadiumRadium","$1,497,823","$0.474556","3,156,262 RADS *",1.95,"-7.45%","sparkline"]
[83,"CloakCoinCloakCoin","$1,497,821","$0.306579","4,885,596 CLOAK *",2.528,"13.41%","sparkline"]
[84,"DubaiCoinDubaiCoin","$1,477,022","$0.248763","5,937,465 DBIC ",16.89,"-19.03%","sparkline"]
[85,"BitBayBitBay","$1,468,300","$0.001458","1,007,354,414 BAY *",13.255000000000001,"-1.87%","sparkline"]
[86,"ExpanseExpanse","$1,441,476","$0.220700","6,531,383 EXP ",10.864000000000001,"0.56%","sparkline"]
[87,"LykkeLykke","$1,410,603","$0.047020","30,000,000 LKK *",3.64,"-0.38%","sparkline"]
[88,"UbiqUbiq","$1,327,636","$0.036464","36,409,401 UBQ ",13.616,"-8.03%","sparkline"]
[89,"AuroracoinAuroracoin","$1,312,314","$0.151570","8,658,139 AUR **",1.413,"-2.40%","sparkline"]
[90,"VertcoinVertcoin","$1,257,770","$0.037075","33,924,927 VTC ",12.72,"-6.97%","sparkline"]
[91,"BelaCoinBelaCoin","$1,255,325","$0.039085","32,117,650 BELA ",50.307000000000002,"-2.33%","sparkline"]
[92,"Pascal CoinPascal Coin","$1,252,319","$0.178228","7,026,500 PASC ",64.379000000000005,"-1.92%","sparkline"]
[93,"IncentIncent","$1,250,532","$0.054351","23,008,312 INCNT *",18.812999999999999,"5.20%","sparkline"]
[94,"AdzcoinAdzcoin","$1,228,568","$0.023102","53,181,080 ADZ ",2.6629999999999998,"-2.97%","sparkline"]
[95,"CureCoinCureCoin","$1,221,457","$0.046212","26,431,310 CURE **",1.1100000000000001,"-1.90%","sparkline"]
[96,"HEATHEAT","$1,187,628","$0.046043","25,793,656 HEAT *",613,"-4.40%","sparkline"]
[97,"NautilusCoinNautilusCoin","$1,171,678","$0.072415","16,180,000 NAUT *",17.215,"-4.20%","sparkline"]
[98,"Global Currency ReserveGlobal Curren...","$1,148,934","$0.011233","102,278,348 GCR *",2.2959999999999998,"-8.59%","sparkline"]
[99,"Steem DollarsSteem Dollars","$1,115,186","$1.02","1,089,783 SBD *",15.273,"3.57%","sparkline"]
[100,"VeriCoinVeriCoin",982.25599999999997,"$0.032748","29,994,759 VRC ",1.42,"-2.63%","sparkline"]
["Next 100 →"]
["View All"]
["* Not Mineable"]
["** Significantly Premined"]
["Total Market Cap: $23,494,267,466 "]
[]
["Last updated: Mar 07, 2017 12:55 PM UTC"]
[]
["© 2017 CoinMarketCap | Advertise | API | Request Form"]
["Donate BTC: 15gJiApW3G9MN2iTteQwQbq7NundwGWwv6"]
["×"]
["Donate Bitcoin"]
["15gJiApW3G9MN2iTteQwQbq7NundwGWwv6"]
["Donate Bitcoin"]

{"sheet":"XE Data","index":3,"n_rows":176,"n_cols":11,"rows_kept":176,"cut":false,"hidden":true,"merged":[]}
["We use cookies to understand our site usage and to customize your experience, including advertising. By using our site, you agree to our use of cookies."]
["The World's Trusted Currency Authority"]
["FAQ"]
["Site Map"]
["Company Info▼"]
["About Us"]
["Contact Us"]
["Newsletters"]
["Partnerships"]
["Careers"]
["Legal"]
["English▼"]
["Deutsch"]
["Español"]
["Français"]
["Português"]
["Italiano"]
["Svenska"]
["简体中文"]
["繁體中文"]
["日本語"]
["العربية"]
["Home"]
["Tools"]
["Currency Converter"]
["Currency Charts"]
["Historical Currency Rates"]
["Travel Expenses Calculator"]
["IBAN Calculator"]
["Currency Email"]
["More..."]
["Transfer Money"]
["XE Money Transfer"]
["Why XE?"]
["How it Works"]
["Currencies"]
["Great Rates & No Fees"]
["Trusted Brand"]
["Secure & Reliable"]
["Account Login"]
["Currency Data"]
["XE Currency Data API Home"]
["Overview"]
["Specifications"]
["Pricing"]
["FAQ"]
["Use our Content"]
["Free Currency Converter"]
["Customize our Converter"]
["Link to XE.com"]
["More Services..."]
["Apps"]
["Android"]
["iPhone"]
["iPad"]
["BlackBerry"]
["BlackBerry 10"]
["Windows Phone"]
["Windows 8"]
["Firefox"]
["Learn"]
["Money Transfer Tips"]
["Intro to Forex Trading"]
["Currency Encyclopedia"]
["Currency Charts"]
["Money Transfer Glossary"]
["Free Currency Email"]
["Learn More..."]
["Blog"]
["Blog"]
["Forum"]
["Ad"]
["AD"]
["XE Live Exchange Rates"]
[59,null,"USD","EUR","GBP","INR","AUD","CAD","ZAR","NZD","JPY"]
[null,"1 USD",100000,"0.94579","0.81994",666340,131642,134076,129595,143146,113962]
[null,"Inverse:",100000,105732,121960,"0.01501","0.75963","0.74584","0.07716","0.69859","0.00877"]
[null,"1 EUR",105732,100000,"0.86694",704533,139188,141761,137023,151351,120494]
[null,"Inverse:","0.94579",100000,115349,"0.01419","0.71845","0.70541","0.07298","0.66072","0.00830"]
[null,"1 GBP",121960,115349,100000,812670,160551,163520,158055,174582,138989]
[null,"Inverse:","0.81994","0.86694",100000,"0.01231","0.62285","0.61155","0.06327","0.57280","0.00719"]
["Mid-market rates: 2017-03-07 12:55 UTC"]
["  Initiate auto-refresh"]
["Did you know?"]
["You can exchange money online with us. Transfer Money ►"]
["Click on a currency code to learn about it."]
["XE Currency Converter"]
["More currencies"]
["Amount "]
["Convert"]
["Full currency list ►"]
["Easy & Secure Currency Transfers. Click Here!!"]
["More Tools & Services"]
["Paste link in email or IM"]
["Link Url"]
["Featured Products"]
["More XE Products"]
["Send Cheap Money Transfers"]
["Get currency rates for your business"]
["Download our Free XE Currency App"]
["AD"]
["Ad"]
["Ad"]
["XE Currency Tools"]
["XE Currency App"]
["Historical Currency Rates"]
["Travel Expenses Calculator"]
["Currency Email Updates"]
["Free Currency Converter"]
["More Tools"]
["XE Market Analysis"]
["Asian Edition"]
["FX trade was quiet in N.Y. on Monday, with major dollar pairings ... Read More ▶"]
["European Edition"]
["The dollar has settled along with other markets as the release of the ... Read More ▶"]
["North American Edition"]
["The dollar has been mixed, posting a three-session high versus the ... Read More ▶"]
["More XE Commentary"]
["Popular Currency Profiles"]
["USD - US Dollar"]
["EUR - Euro"]
["GBP - British Pound"]
["INR - Indian Rupee"]
["AUD - Australian Dollar"]
["CAD - Canadian Dollar"]
["SGD - Singapore Dollar"]
["CHF - Swiss Franc"]
["MYR - Malaysian Ringgit"]
["JPY - Japanese Yen"]
["CNY - Chinese Yuan Renminbi"]
["More currencies"]
["Get an XE account"]
["Sign up FREE!"]
["Access premium XE Services like Rate Alerts. Learn more ▶"]
["Tools"]
["Currency Converter"]
["Currency Charts"]
["Currency Emails"]
["Historical Rates"]
["Expense Calculator"]
["IBAN Calculator"]
["Transfer Money"]
["XE Money Transfer"]
["Why XE?"]
["How it Works"]
["Currencies"]
["Great Rates & No Fees"]
["Trusted Brand"]
["Secure & Reliable"]
["Account Login"]
["Important Information"]
["Currency Data"]
["Currency Data API"]
["Overview"]
["Specifications"]
["Pricing"]
["FAQ"]
["Apps"]
["iPhone"]
["Android"]
["BlackBerry"]
["Windows Phone"]
["More..."]
["Use our Content"]
["Free Converter"]
["Customized Converter"]
["Link to XE"]
["Learn"]
["Money Transfer Tips"]
["XE Currency Blog"]
["Currency Encyclopedia"]
["Intro to Forex Trading"]
["Money Transfer Glossary"]
["Top · 2017-03-07 12:56 UTC (GMT)"]
["© 1995-2017 · Site Map · Privacy · Terms of Use"]
["dcsimg"]